In short: AXI4-Stream is a lightweight, address-less, one-way point-to-point protocol where a master pushes data to a slave through a simple TVALID/TREADY handshake, using TLAST to mark packet boundaries — making it the backbone of DMA engines, video pipelines, and FPGA dataflow IP.
If AXI4 (full) is a highway with addresses, bursts, and five independent channels, AXI4-Stream is a single conveyor belt. It drops the entire concept of an address and keeps only one thing: get a continuous flow of data bytes from a producer to a consumer as fast as both can manage, with clean backpressure. That minimalism is exactly why it dominates streaming datapaths in Xilinx/AMD and Intel/Altera FPGA designs, Synopsys/Cadence verification IP, and every DMA-to-accelerator link you will meet in an interview.
Why a separate streaming protocol exists
Memory-mapped AXI needs an address for every transaction, read/write channels, response codes, and ID-based reordering. That machinery is wasted when data has no natural "location" — the samples coming off an ADC, pixels scanning out of a camera, or packets leaving a network MAC. For these, you only care about order and flow control, not where each byte "lives". AXI4-Stream strips the protocol down to one channel carrying data plus a handshake, which keeps the interface narrow, the logic shallow, and the throughput high.
Key fact: AXI4-Stream has exactly one data channel and no address bus. Everything travels master → slave. If you need to send data back, you instantiate a second, independent stream in the opposite direction.
The TVALID / TREADY handshake
The whole protocol rests on two signals. TVALID is driven by the master and means "the data on TDATA is valid this cycle." TREADY is driven by the slave and means "I can accept a transfer this cycle." A transfer happens on one, and only one, rising clock edge where both TVALID and TREADY are high simultaneously. That single rule gives you full, lossless backpressure for free.
Three ordering rules matter in interviews and in RTL reviews:
- Once a master asserts TVALID, it must not deassert it until the transfer completes (TREADY also high). You cannot "take back" valid data.
- TVALID must never be made to wait for TREADY. A master is free to assert TVALID before the slave is ready; the slave may assert TREADY before, during, or after TVALID. This prevents a combinational deadlock loop.
- When neither is high, or only one is high, the bus simply stalls — no data moves and nothing is lost.
Watching a beat move: the animated handshake
The clearest way to internalise AXI-Stream is to watch a data beat travel down the belt only when both lights are green. In the animation below, a packet advances one stage per accepted transfer; when TREADY drops (the slave is busy), the packet freezes mid-belt — that frozen state is backpressure.
The sideband signals: TLAST, TKEEP, TSTRB, TID, TDEST, TUSER
Beyond data and the handshake, AXI-Stream defines optional signals that most real IP uses:
| Signal | Driven by | Purpose |
|---|---|---|
| TDATA | Master | The payload. Width is a power-of-two bytes (e.g. 32, 64, 128 bits). |
| TLAST | Master | Marks the final beat of a packet/frame. Critical for DMA and framing. |
| TKEEP | Master | Per-byte qualifier: which bytes are real data vs null (for ragged tail beats). |
| TSTRB | Master | Distinguishes data bytes from position bytes; often tied equal to TKEEP. |
| TID / TDEST | Master | Stream identifier and routing destination — used by AXI-Stream Interconnect/switch. |
| TUSER | Master | User sideband, e.g. "start-of-frame" or pixel metadata in video. |
Key fact: TLAST is what lets a downstream DMA write a complete descriptor. A 1080p frame streamed at 64-bit width is ~1920×1080×3 bytes ÷ 8 = roughly 777,600 beats; TLAST pulses once, on the final beat, so software knows the frame is done.
AXI-Stream in a DMA datapath
The canonical use is a scatter-gather DMA (Xilinx AXI DMA, or an Intel mSGDMA). The CPU sets up a descriptor, the DMA reads from DDR over memory-mapped AXI, then pushes the payload out of its MM2S (memory-mapped to stream) port as an AXI-Stream into an accelerator. The accelerator processes and returns a stream that the DMA's S2MM port writes back to DDR. TLAST on the return stream tells the DMA where each buffer ends and triggers the completion interrupt. If TLAST is missing or misplaced — a classic bring-up bug — the DMA either hangs waiting for the end of a packet or truncates the transfer. When you see "DMA transfer never completes" in a lab, TLAST timing is the first thing to probe with a Synopsys/Siemens logic analyzer or an ILA.
AXI-Stream in video pipelines
Video is a natural fit: pixels are inherently a one-way, ordered stream. In a typical AMD Vivado pipeline, a Video-DMA or MIPI CSI-2 receiver emits an AXI4-Stream where TUSER[0] carries start-of-frame and TLAST carries end-of-line. Blocks like a color-space converter, a 2D filter, or a scaler chain together, each honoring TREADY so a slow downstream block throttles the whole pipe without dropping pixels. Throughput math is unforgiving here: 4K60 is 3840×2160×60 ≈ 497 Mpixels/s. At two pixels per beat you need ~249 M beats/s, so a 150 MHz pipe must be at least two-pixel-wide — these are exactly the capacity questions interviewers push on.
For the memory-mapped cousin that handles addressed bursts instead of free-running streams, compare this with AXI burst types (INCR, WRAP, FIXED), and for the handshake foundations shared across the family see our note on valid/ready handshaking. A broader walk-through sits in the CourseTron protocol courses.
Verification and common pitfalls
In UVM testbenches, Synopsys VIP, Cadence VIP, and Siemens QuestaSim all ship AXI-Stream agents that randomize TVALID/TREADY toggling and inject stall patterns. The bugs that recur: deasserting TVALID before a transfer completes; making TVALID depend combinationally on TREADY (deadlock); mismatched TDATA widths without TKEEP handling on the tail beat; and forgetting that TLAST is per-packet, not per-beat. A good checklist is to assert, in SystemVerilog assertions, that TVALID stays stable until accepted and that TDATA/TLAST do not change while stalled.
Teams building custom streaming accelerators or needing silicon-proven AXI datapath IP often lean on specialist design houses — Avecas VLSI design services is one example of where this interface work gets productised.
Want to wire up a real MM2S/S2MM DMA and a video pipe in Vivado, with waveforms and UVM checks? The CourseTron AMBA & SoC Interfaces course walks you through AXI-Stream end to end — enrol and build it hands-on.
FAQ
What is the difference between AXI4 and AXI4-Stream?
AXI4 (full) is memory-mapped with addresses, bursts, and five channels for addressed read/write transactions. AXI4-Stream has no address at all — it is a single unidirectional data channel with a TVALID/TREADY handshake, built for continuous dataflow rather than addressed access.
What does TLAST do in AXI-Stream?
TLAST is asserted by the master on the final beat of a packet or frame. It lets the downstream block — typically a DMA — know where one logical transfer ends, so it can close a buffer, raise a completion interrupt, and start the next descriptor.
Can AXI-Stream lose data?
No. The TVALID/TREADY handshake guarantees a transfer only occurs when both are high on the same clock edge. If the slave cannot accept data it holds TREADY low, the master holds its valid data, and the stream simply stalls — nothing is dropped.
Is AXI-Stream point-to-point or multi-master?
The base protocol is strictly point-to-point, one master to one slave. To route or merge multiple streams you add an AXI-Stream Interconnect/switch that uses TID and TDEST to arbitrate and steer traffic.